BDBM61922 2-(2,4-dichlorophenyl)-1,2-benzothiazol-3-one::KSC-09-033::KUC103882N::cid_22416251
SMILES Clc1ccc(c(Cl)c1)-n1sc2ccccc2c1=O
InChI Key InChIKey=NBFFOCQKEJRAPM-UHFFFAOYSA-N
Data  2 IC50
  Tab Delimited (TSV)   2D SDfile   Computed 3D by Vconf -m prep SDfile
Find this compound or compounds like it in BindingDB:
Activity Spreadsheet -- Enzyme Inhibition Constant Data from BindingDB
Found 1 hit for monomerid = 61922
TargetGlucose-6-phosphate 1-dehydrogenase(Leuconostoc mesenteroides)
University of Pittsburgh
Curated by PubChem BioAssay
LigandPNGBDBM61922(2-(2,4-dichlorophenyl)-1,2-benzothiazol-3-one | KS...)
Affinity DataIC50: >2.50E+4nM. Assay description: Excerpt from MH082340 application (Dr. James Morris, Clemson University) Trypanosoma brucei, the digenic protozoan parasite that causes African sleep...
In DepthDetails PCBioAssay